Reaction Details
TargetVasopressin V1b receptor
LigandBDBM50342028
Substrate/Competitorn/a
Meas. Tech.ChEMBL_743726 (CHEMBL1767540)
EC50 1.5±n/a nM
Citation Corbani, MTrueba, MStoev, SMurat, BMion, JBoulay, VGuillon, GManning, M Design, synthesis, and pharmacological characterization of fluorescent peptides for imaging human V1b vasopressin or oxytocin receptors. J Med Chem54:2864-77 (2011) 
 
Vasopressin V1b receptor
Name:Vasopressin V1b receptor
Type:Enzyme
Mol. Mass.:46985.01
Organism:Homo sapiens (Human)
Description:P47901
Residue:424
BDBM50342028
NameBDBM50342028
Synonyms:2-((S)-6-amino-2-((S)-1-((4R,7S,10S,13S,16S)-7-(2-amino-2-oxoethyl)-13-benzyl-16-(4-hydroxybenzyl)-10-isobutyl-6,9,12,15,18-pentaoxo-1,2-dithia-5,8,11,14,17-pentaazacycloicosane-4-carbonyl)pyrrolidine-2-carboxamido)hexanamido)acetic acid | CHEMBL1765663
TypeSmall organic molecule
Emp. Form.C47H66N10O12S2
Mol. Mass.1027.217
SMILESCC(C)C[C@@H]1NC(=O)[C@H](Cc2ccccc2)NC(=O)[C@H](Cc2ccc(O)cc2)NC(=O)CCSSC[C@H](NC(=O)[C@H](CC(N)=O)NC1=O)C(=O)N1CCC[C@H]1C(=O)N[C@@H](CCCCN)C(=O)NCC(O)=O