Reaction Details
TargetCytochrome P450 26A1
LigandBDBM50342135
Substrate/Competitorn/a
Meas. Tech.ChEMBL_744044 (CHEMBL1768149)
IC50 26±n/a nM
Citation Gomaa, MSBridgens, CEAboraia, ASVeal, GJRedfern, CPBrancale, AArmstrong, JLSimons, C Small molecule inhibitors of retinoic acid 4-hydroxylase (CYP26): synthesis and biological evaluation of imidazole methyl 3-(4-(aryl-2-ylamino)phenyl)propanoates. J Med Chem54:2778-91 (2011) 
 
Cytochrome P450 26A1
Name:Cytochrome P450 26A1
Type:Enzyme
Mol. Mass.:56216.16
Organism:Homo sapiens (Human)
Description:O43174
Residue:497
BDBM50342135
NameBDBM50342135
Synonyms:CHEMBL1766011 | Methyl syn-3-(1H-1-Imidazolyl)-3-[4-(phenylamino)phenyl]-2-methylpropanoate
TypeSmall organic molecule
Emp. Form.C20H21N3O2
Mol. Mass.335.3996
SMILESCOC(=O)[C@H](C)[C@H](c1ccc(Nc2ccccc2)cc1)n1ccnc1