Reaction Details
TargetCytochrome P450 26A1
LigandBDBM50342141
Substrate/Competitorn/a
Meas. Tech.ChEMBL_744044 (CHEMBL1768149)
IC50 8±n/a nM
Citation Gomaa, MSBridgens, CEAboraia, ASVeal, GJRedfern, CPBrancale, AArmstrong, JLSimons, C Small molecule inhibitors of retinoic acid 4-hydroxylase (CYP26): synthesis and biological evaluation of imidazole methyl 3-(4-(aryl-2-ylamino)phenyl)propanoates. J Med Chem54:2778-91 (2011) 
 
Cytochrome P450 26A1
Name:Cytochrome P450 26A1
Type:Enzyme
Mol. Mass.:56216.16
Organism:Homo sapiens (Human)
Description:O43174
Residue:497
BDBM50342141
NameBDBM50342141
Synonyms:3-[4-(Benzo[1,3]dioxol-5-ylamino)-phenyl]-3-imidazol-1-yl-2,2-dimethylpropionicAcid Methyl Ester | CHEMBL1766001
TypeSmall organic molecule
Emp. Form.C22H23N3O4
Mol. Mass.393.4357
SMILESCOC(=O)C(C)(C)C(c1ccc(Nc2ccc3OCOc3c2)cc1)n1ccnc1