Reaction Details
TargetTGF-beta receptor type-1
LigandBDBM50252542
Substrate/Competitorn/a
Meas. Tech.ChEMBL_743053 (CHEMBL1768524)
IC50 480±n/a nM
Citation Jin, CHKrishnaiah, MSreenu, DRao, KSSubrahmanyam, VBPark, CYSon, JYSheen, YYKim, DK Synthesis and biological evaluation of 1-substituted-3(5)-(6-methylpyridin-2-yl)-4-(quinolin-6-yl)pyrazoles as transforming growth factor-β type 1 receptor kinase inhibitors. Bioorg Med Chem19:2633-40 (2011) 
 
TGF-beta receptor type-1
Name:TGF-beta receptor type-1
Type:enzyme
Mol. Mass.:55968.24
Organism:Homo sapiens (Human)
Description:P36897
Residue:503
BDBM50252542
NameBDBM50252542
Synonyms:3-((5-(6-methylpyridin-2-yl)-4-(quinoxalin-6-yl)-1H-imidazol-2-yl)methyl)benzamide IN-1130
TypeSmall organic molecule
Emp. Form.C25H20N6O
Mol. Mass.420.4659
SMILESCc1cccc(n1)-c1nc(Cc2cccc(c2)C(N)=O)[nH]c1-c1ccc2nccnc2c1