Reaction Details
TargetMitogen-activated protein kinase 10
LigandBDBM50342502
Substrate/Competitorn/a
Meas. Tech.ChEMBL_744647 (CHEMBL1772668)
IC50 7±n/a nM
Citation Noël, RShin, YSong, XHe, YKoenig, MChen, WLing, YYLin, LRuiz, CHLoGrasso, PCameron, MDDuckett, DRKamenecka, TM Synthesis and SAR of 4-(pyrazol-3-yl)-pyridines as novel c-jun N-terminal kinase inhibitors. Bioorg Med Chem Lett21:2732-5 (2011) 
 
Mitogen-activated protein kinase 10
Name:Mitogen-activated protein kinase 10
Type:Enzyme
Mol. Mass.:52586.89
Organism:Homo sapiens (Human)
Description:n/a
Residue:464
BDBM50342502
NameBDBM50342502
Synonyms:CHEMBL1771718 | N-(4-(3,5-dimethyl-1H-1,2,4-triazol-1-yl)phenyl)-4-(4-(4-fluorophenyl)-1-methyl-1H-pyrazol-3-yl)pyridin-2-amine
TypeSmall organic molecule
Emp. Form.C25H22FN7
Mol. Mass.439.4875
SMILESCc1nc(C)n(n1)-c1ccc(Nc2cc(ccn2)-c2nn(C)cc2-c2ccc(F)cc2)cc1