Reaction Details
TargetRibose-5-phosphate isomerase B
LigandBDBM50148767
Substrate/Competitorn/a
Meas. Tech.ChEMBL_744989 (CHEMBL1772004)
Ki 400000±n/a nM
Citation Yep, ASorenson, RJWilson, MRShowalter, HDLarsen, SDKeller, PRWoodard, RW Enediol mimics as inhibitors of the D-arabinose 5-phosphate isomerase (KdsD) from Francisella tularensis. Bioorg Med Chem Lett21:2679-82 (2011) 
 
Ribose-5-phosphate isomerase B
Name:Ribose-5-phosphate isomerase B
Type:PROTEIN
Mol. Mass.:17277.83
Organism:Mycobacterium tuberculosis
Description:ChEMBL_744989
Residue:162
BDBM50148767
NameBDBM50148767
Synonyms:2,3-dihydroxy-4-(hydroxyamino)-4-oxobutyl dihydrogen phosphate CHEMBL116018 | Phosphoric acid mono-((1R,3R)-2,3-dihydroxy-3-hydroxycarbamoyl-propyl) ester
TypeSmall organic molecule
Emp. Form.C4H10NO8P
Mol. Mass.231.0979
SMILESONC(=O)[C@H](O)[C@H](O)COP(O)(O)=O