Reaction Details
Target6-phosphogluconate dehydrogenase, decarboxylating
LigandBDBM50148780
Substrate/Competitorn/a
Meas. Tech.ChEMBL_744988 (CHEMBL1772003)
Ki 35±n/a nM
Citation Yep, ASorenson, RJWilson, MRShowalter, HDLarsen, SDKeller, PRWoodard, RW Enediol mimics as inhibitors of the D-arabinose 5-phosphate isomerase (KdsD) from Francisella tularensis. Bioorg Med Chem Lett21:2679-82 (2011) 
 
6-phosphogluconate dehydrogenase, decarboxylating
Name:6-phosphogluconate dehydrogenase, decarboxylating
Synonyms:6-phosphogluconate dehydrogenase, decarboxylating, putative
Type:PROTEIN
Mol. Mass.:52169.87
Organism:Trypanosoma brucei brucei (strain 927/4 GUTat10.1)
Description:ChEMBL_744988
Residue:479
BDBM50148780
NameBDBM50148780
TypeSmall organic molecule
Emp. Form.C7H14NO8P
Mol. Mass.271.1617
SMILESCC1(C)O[C@H](COP(O)(O)=O)[C@@H](O1)C(=O)NO