Reaction Details
Target6-phosphogluconate dehydrogenase, decarboxylating
LigandBDBM50148765
Substrate/Competitorn/a
Meas. Tech.ChEMBL_744988 (CHEMBL1772003)
Ki 80±n/a nM
Citation Yep, ASorenson, RJWilson, MRShowalter, HDLarsen, SDKeller, PRWoodard, RW Enediol mimics as inhibitors of the D-arabinose 5-phosphate isomerase (KdsD) from Francisella tularensis. Bioorg Med Chem Lett21:2679-82 (2011) 
 
6-phosphogluconate dehydrogenase, decarboxylating
Name:6-phosphogluconate dehydrogenase, decarboxylating
Synonyms:6-phosphogluconate dehydrogenase, decarboxylating, putative
Type:PROTEIN
Mol. Mass.:52169.87
Organism:Trypanosoma brucei brucei (strain 927/4 GUTat10.1)
Description:ChEMBL_744988
Residue:479
BDBM50148765
NameBDBM50148765
TypeSmall organic molecule
Emp. Form.C8H14NO10P
Mol. Mass.315.1712
SMILESCC(=O)O[C@H](COP(O)(O)=O)[C@@H](OC(C)=O)C(=O)NO