Reaction Details
TargetCalcitonin gene-related peptide type 1 receptor
LigandBDBM50342619
Substrate/Competitorn/a
Meas. Tech.ChEMBL_745045 (CHEMBL1772121)
Ki 5.7±n/a nM
Citation Paone, DVNguyen, DNShaw, AWBurgey, CSPotteiger, CMDeng, JZMosser, SDSalvatore, CAYu, SRoller, SKane, SASelnick, HGVacca, JPWilliams, TM Orally bioavailable imidazoazepanes as calcitonin gene-related peptide (CGRP) receptor antagonists: discovery of MK-2918. Bioorg Med Chem Lett21:2683-6 (2011) 
 
Calcitonin gene-related peptide type 1 receptor
Name:Calcitonin gene-related peptide type 1 receptor
Type:Enzyme Catalytic Domain
Mol. Mass.:52980.45
Organism:Homo sapiens (Human)
Description:Q16602
Residue:461
BDBM50342619
NameBDBM50342619
Synonyms:CHEMBL1770564 | N-((6S,9R)-6-(2,3-difluorophenyl)-3-(2-(methylamino)ethyl)-6,7,8,9-tetrahydro-5H-imidazo[1,2-a]azepin-9-yl)-4-(2-oxo-2,3-dihydro-1H-imidazo[4,5-b]pyridin-1-yl)piperidine-1-carboxamide
TypeSmall organic molecule
Emp. Form.C29H34F2N8O2
Mol. Mass.564.6295
SMILESCNCCc1cnc2[C@@H](CC[C@H](Cn12)c1cccc(F)c1F)NC(=O)N1CCC(CC1)n1c2cccnc2[nH]c1=O