Reaction Details
TargetD(3) dopamine receptor
LigandBDBM50342711
Substrate/Competitorn/a
Meas. Tech.ChEMBL_744158 (CHEMBL1771857)
Ki 0.27±n/a nM
Citation Ortega, RHübner, HGmeiner, PMasaguer, CF Aromatic ring functionalization of benzolactam derivatives: new potent dopamine D3 receptor ligands. Bioorg Med Chem Lett21:2670-4 (2011) 
 
D(3) dopamine receptor
Name:D(3) dopamine receptor
Type:n/a
Mol. Mass.:44243.43
Organism:Homo sapiens (Human)
Description:n/a
Residue:400
BDBM50342711
NameBDBM50342711
Synonyms:7-methoxy-2-(4-(4-(2-methoxyphenyl)piperazin-1-yl)butyl)-2,3,4,5-tetrahydro-1H-benzo[c]azepin-1-one | CHEMBL1771105
TypeSmall organic molecule
Emp. Form.C26H35N3O3
Mol. Mass.437.5744
SMILESCOc1ccc2c(CCCN(CCCCN3CCN(CC3)c3ccccc3OC)C2=O)c1