Reaction Details
TargetD(3) dopamine receptor
LigandBDBM50342713
Substrate/Competitorn/a
Meas. Tech.ChEMBL_744158 (CHEMBL1771857)
Ki 0.25±n/a nM
Citation Ortega, RHübner, HGmeiner, PMasaguer, CF Aromatic ring functionalization of benzolactam derivatives: new potent dopamine D3 receptor ligands. Bioorg Med Chem Lett21:2670-4 (2011) 
 
D(3) dopamine receptor
Name:D(3) dopamine receptor
Type:n/a
Mol. Mass.:44243.43
Organism:Homo sapiens (Human)
Description:n/a
Residue:400
BDBM50342713
NameBDBM50342713
Synonyms:3,4-Dihydro-2-[4-(4-(2-methoxyphenyl)piperazin-1-yl)butyl]-6-phenylisoquinolin-1(2H)-one | CHEMBL1771107
TypeSmall organic molecule
Emp. Form.C30H35N3O2
Mol. Mass.469.6178
SMILESCOc1ccccc1N1CCN(CCCCN2CCc3cc(ccc3C2=O)-c2ccccc2)CC1