Reaction Details
TargetD(3) dopamine receptor
LigandBDBM50342707
Substrate/Competitorn/a
Meas. Tech.ChEMBL_744158 (CHEMBL1771857)
Ki 1.3±n/a nM
Citation Ortega, RHübner, HGmeiner, PMasaguer, CF Aromatic ring functionalization of benzolactam derivatives: new potent dopamine D3 receptor ligands. Bioorg Med Chem Lett21:2670-4 (2011) 
 
D(3) dopamine receptor
Name:D(3) dopamine receptor
Type:n/a
Mol. Mass.:44243.43
Organism:Homo sapiens (Human)
Description:n/a
Residue:400
BDBM50342707
NameBDBM50342707
Synonyms:2-[4-(4-(2-Methoxyphenyl)piperazin-1-yl)butyl]-1-oxo-1,2,3,4-tetrahydroisoquinoline-6-carbonitrile | CHEMBL1771113
TypeSmall organic molecule
Emp. Form.C25H30N4O2
Mol. Mass.418.5313
SMILESCOc1ccccc1N1CCN(CCCCN2CCc3cc(ccc3C2=O)C#N)CC1