Reaction Details
Target5-hydroxytryptamine receptor 2A
LigandBDBM50342714
Substrate/Competitorn/a
Meas. Tech.ChEMBL_744161 (CHEMBL1771860)
Ki 230±n/a nM
Citation Ortega, RHübner, HGmeiner, PMasaguer, CF Aromatic ring functionalization of benzolactam derivatives: new potent dopamine D3 receptor ligands. Bioorg Med Chem Lett21:2670-4 (2011) 
 
5-hydroxytryptamine receptor 2A
Name:5-hydroxytryptamine receptor 2A
Type:Enzyme Catalytic Domain
Mol. Mass.:52679.13
Organism:PIG
Description:5-HT2 0 0::P50129
Residue:470
BDBM50342714
NameBDBM50342714
Synonyms:3,4-Dihydro-2-[4-(4-(2-methoxyphenyl)piperazin-1-yl)butyl]-5-phenylisoquinolin-1(2H)-one | CHEMBL1771108
TypeSmall organic molecule
Emp. Form.C30H35N3O2
Mol. Mass.469.6178
SMILESCOc1ccccc1N1CCN(CCCCN2CCc3c(cccc3-c3ccccc3)C2=O)CC1