Reaction Details
Target5-hydroxytryptamine receptor 2A
LigandBDBM50342715
Substrate/Competitorn/a
Meas. Tech.ChEMBL_744161 (CHEMBL1771860)
Ki 330±n/a nM
Citation Ortega, RHübner, HGmeiner, PMasaguer, CF Aromatic ring functionalization of benzolactam derivatives: new potent dopamine D3 receptor ligands. Bioorg Med Chem Lett21:2670-4 (2011) 
 
5-hydroxytryptamine receptor 2A
Name:5-hydroxytryptamine receptor 2A
Type:Enzyme Catalytic Domain
Mol. Mass.:52679.13
Organism:PIG
Description:5-HT2 0 0::P50129
Residue:470
BDBM50342715
NameBDBM50342715
Synonyms:3,4-Dihydro-6-(2-furyl)-2-[4-(4-(2-methoxyphenyl)piperazin-1-yl)butyl]isoquinolin-1(2H)-one | CHEMBL1771109
TypeSmall organic molecule
Emp. Form.C28H33N3O3
Mol. Mass.459.5799
SMILESCOc1ccccc1N1CCN(CCCCN2CCc3cc(ccc3C2=O)-c2ccco2)CC1