Reaction Details
Target5-hydroxytryptamine receptor 2A
LigandBDBM50342705
Substrate/Competitorn/a
Meas. Tech.ChEMBL_744161 (CHEMBL1771860)
Ki 530±n/a nM
Citation Ortega, RHübner, HGmeiner, PMasaguer, CF Aromatic ring functionalization of benzolactam derivatives: new potent dopamine D3 receptor ligands. Bioorg Med Chem Lett21:2670-4 (2011) 
 
5-hydroxytryptamine receptor 2A
Name:5-hydroxytryptamine receptor 2A
Type:Enzyme Catalytic Domain
Mol. Mass.:52679.13
Organism:PIG
Description:5-HT2 0 0::P50129
Residue:470
BDBM50342705
NameBDBM50342705
Synonyms:2-[4-(4-(2-Methoxyphenyl)piperazin-1-yl)butyl]-2,3,4,5-tetrahydro-7-(2-thienyl)benzo[c]azepin-1-one | CHEMBL1771111
TypeSmall organic molecule
Emp. Form.C29H35N3O2S
Mol. Mass.489.672
SMILESCOc1ccccc1N1CCN(CCCCN2CCCc3cc(ccc3C2=O)-c2cccs2)CC1