Reaction Details
TargetD(1A) dopamine receptor
LigandBDBM50342706
Substrate/Competitorn/a
Meas. Tech.ChEMBL_744155 (CHEMBL1771854)
Ki 380±n/a nM
Citation Ortega, RHübner, HGmeiner, PMasaguer, CF Aromatic ring functionalization of benzolactam derivatives: new potent dopamine D3 receptor ligands. Bioorg Med Chem Lett21:2670-4 (2011) 
 
D(1A) dopamine receptor
Name:D(1A) dopamine receptor
Type:PROTEIN
Mol. Mass.:49269.92
Organism:Sus scrofa
Description:ChEMBL_1460140
Residue:446
BDBM50342706
NameBDBM50342706
Synonyms:3,4-Dihydro-2-[4-(4-(2-methoxyphenyl)piperazin-1-yl)butyl]-6-(4-pyridyl)isoquinolin-1(2H)-one | CHEMBL1771112
TypeSmall organic molecule
Emp. Form.C29H34N4O2
Mol. Mass.470.6059
SMILESCOc1ccccc1N1CCN(CCCCN2CCc3cc(ccc3C2=O)-c2ccncc2)CC1