Reaction Details
TargetProtein-S-isoprenylcysteine O-methyltransferase
LigandBDBM50342747
Substrate/Competitorn/a
Meas. Tech.ChEMBL_744272 (CHEMBL1772079)
IC50 13400±n/a nM
Citation Majmudar, JDHahne, KHrycyna, CAGibbs, RA Probing the isoprenylcysteine carboxyl methyltransferase (Icmt) binding pocket: sulfonamide modified farnesyl cysteine (SMFC) analogs as Icmt inhibitors. Bioorg Med Chem Lett21:2616-20 (2011) 
 
Protein-S-isoprenylcysteine O-methyltransferase
Name:Protein-S-isoprenylcysteine O-methyltransferase
Type:PROTEIN
Mol. Mass.:31943.26
Organism:Homo sapiens (Human)
Description:ChEMBL_956034
Residue:284
BDBM50342747
NameBDBM50342747
Synonyms:3-nitrophenyl-sulfonamido-farnesylcysteine | CHEMBL1771305
TypeSmall organic molecule
Emp. Form.C24H34N2O6S2
Mol. Mass.510.667
SMILES[#6]\[#6](-[#6])=[#6]\[#6]-[#6]\[#6](-[#6])=[#6]\[#6]-[#6]\[#6](-[#6])=[#6]\[#6]-[#16]-[#6]-[#6@H](-[#7]S(=O)(=O)c1cccc(c1)-[#7+](-[#8-])=O)-[#6](-[#8])=O