Reaction Details
TargetMelatonin receptor type 1A
LigandBDBM50342770
Substrate/Competitorn/a
Meas. Tech.ChEMBL_744407 (CHEMBL1772361)
IC50 0.875000±n/a nM
Citation Leclerc, VEttaoussi, MRami, MFarce, ABoutin, JADelagrange, PCaignard, DHRenard, PBerthelot, PYous, S Design and synthesis of naphthalenic derivatives as new ligands at the melatonin binding site MT3. Eur J Med Chem46:1622-9 (2011) 
 
Melatonin receptor type 1A
Name:Melatonin receptor type 1A
Type:Enzyme
Mol. Mass.:39392.94
Organism:Homo sapiens (Human)
Description:P48039
Residue:350
BDBM50342770
NameBDBM50342770
Synonyms:CHEMBL456727 N-[2-(7-methylsulfanyl-naphth-1-yl)ethyl]acetamide
TypeSmall organic molecule
Emp. Form.C15H17NOS
Mol. Mass.259.367
SMILESCSc1ccc2cccc(CCNC(C)=O)c2c1