Reaction Details
TargetDual specificity protein kinase CLK3
LigandBDBM50342927
Substrate/Competitorn/a
Meas. Tech.ChEMBL_744229 (CHEMBL1772036)
IC50 6172±n/a nM
Citation Rosenthal, ASTanega, CShen, MMott, BTBougie, JMNguyen, DTMisteli, TAuld, DSMaloney, DJThomas, CJ Potent and selective small molecule inhibitors of specific isoforms of Cdc2-like kinases (Clk) and dual specificity tyrosine-phosphorylation-regulated kinases (Dyrk). Bioorg Med Chem Lett21:3152-8 (2011) 
 
Dual specificity protein kinase CLK3
Name:Dual specificity protein kinase CLK3
Type:Protein
Mol. Mass.:73570.11
Organism:Homo sapiens (Human)
Description:n/a
Residue:638
BDBM50342927
NameBDBM50342927
Synonyms:6-(benzo[d][1,3]dioxol-5-yl)-N-ethyl-N-(thiophen-2-ylmethyl)quinazolin-4-amine | CHEMBL1515144
TypeSmall organic molecule
Emp. Form.C22H19N3O2S
Mol. Mass.389.47
SMILESCCN(Cc1cccs1)c1ncnc2ccc(cc12)-c1ccc2OCOc2c1