Reaction Details
TargetDual specificity protein kinase CLK3
LigandBDBM50342912
Substrate/Competitorn/a
Meas. Tech.ChEMBL_744229 (CHEMBL1772036)
IC50>10000±n/a nM
Citation Rosenthal, ASTanega, CShen, MMott, BTBougie, JMNguyen, DTMisteli, TAuld, DSMaloney, DJThomas, CJ Potent and selective small molecule inhibitors of specific isoforms of Cdc2-like kinases (Clk) and dual specificity tyrosine-phosphorylation-regulated kinases (Dyrk). Bioorg Med Chem Lett21:3152-8 (2011) 
 
Dual specificity protein kinase CLK3
Name:Dual specificity protein kinase CLK3
Type:Protein
Mol. Mass.:73570.11
Organism:Homo sapiens (Human)
Description:n/a
Residue:638
BDBM50342912
NameBDBM50342912
Synonyms:6-(benzo[d][1,3]dioxol-5-yl)-N-methyl-N-((5-methyl-1,3,4-oxadiazol-2-yl)methyl)quinazolin-4-amine | CHEMBL1437638
TypeSmall organic molecule
Emp. Form.C20H17N5O3
Mol. Mass.375.3807
SMILESCN(Cc1nnc(C)o1)c1ncnc2ccc(cc12)-c1ccc2OCOc2c1