Reaction Details
TargetDual specificity protein kinase CLK1
LigandBDBM50342916
Substrate/Competitorn/a
Meas. Tech.ChEMBL_744231 (CHEMBL1772038)
Kd 18±n/a nM
Citation Rosenthal, ASTanega, CShen, MMott, BTBougie, JMNguyen, DTMisteli, TAuld, DSMaloney, DJThomas, CJ Potent and selective small molecule inhibitors of specific isoforms of Cdc2-like kinases (Clk) and dual specificity tyrosine-phosphorylation-regulated kinases (Dyrk). Bioorg Med Chem Lett21:3152-8 (2011) 
 
Dual specificity protein kinase CLK1
Name:Dual specificity protein kinase CLK1
Type:Protein
Mol. Mass.:57322.21
Organism:Homo sapiens (Human)
Description:P49759
Residue:484
BDBM50342916
NameBDBM50342916
Synonyms:6-(benzo[d][1,3]dioxol-5-yl)-N-methyl-N-((2-methylthiazol-4-yl)methyl)quinazolin-4-amine | CHEMBL1474834
TypeSmall organic molecule
Emp. Form.C21H18N4O2S
Mol. Mass.390.458
SMILESCN(Cc1csc(C)n1)c1ncnc2ccc(cc12)-c1ccc2OCOc2c1