Reaction Details
TargetDual specificity protein kinase CLK4
LigandBDBM50342892
Substrate/Competitorn/a
Meas. Tech.ChEMBL_744233 (CHEMBL1772040)
Kd 30±n/a nM
Citation Rosenthal, ASTanega, CShen, MMott, BTBougie, JMNguyen, DTMisteli, TAuld, DSMaloney, DJThomas, CJ Potent and selective small molecule inhibitors of specific isoforms of Cdc2-like kinases (Clk) and dual specificity tyrosine-phosphorylation-regulated kinases (Dyrk). Bioorg Med Chem Lett21:3152-8 (2011) 
 
Dual specificity protein kinase CLK4
Name:Dual specificity protein kinase CLK4
Type:Serine/threonine-protein kinase
Mol. Mass.:57522.53
Organism:Homo sapiens (Human)
Description:gi_10190706
Residue:481
BDBM50342892
NameBDBM50342892
Synonyms:6-(benzo[d][1,3]dioxol-5-yl)-N-((tetrahydrofuran-3-yl)methyl)quinazolin-4-amine | CHEMBL1436585
TypeSmall organic molecule
Emp. Form.C20H19N3O3
Mol. Mass.349.3832
SMILESC(Nc1ncnc2ccc(cc12)-c1ccc2OCOc2c1)C1CCOC1