Reaction Details
TargetDual specificity protein kinase CLK4
LigandBDBM50302984
Substrate/Competitorn/a
Meas. Tech.ChEMBL_744201 (CHEMBL1771958)
IC50 38±n/a nM
Citation Rosenthal, ASTanega, CShen, MMott, BTBougie, JMNguyen, DTMisteli, TAuld, DSMaloney, DJThomas, CJ Potent and selective small molecule inhibitors of specific isoforms of Cdc2-like kinases (Clk) and dual specificity tyrosine-phosphorylation-regulated kinases (Dyrk). Bioorg Med Chem Lett21:3152-8 (2011) 
 
Dual specificity protein kinase CLK4
Name:Dual specificity protein kinase CLK4
Type:Serine/threonine-protein kinase
Mol. Mass.:57522.53
Organism:Homo sapiens (Human)
Description:gi_10190706
Residue:481
BDBM50302984
NameBDBM50302984
Synonyms:6-(benzo[d][1,3]dioxol-5-yl)-N-(furan-3-ylmethyl)quinazolin-4-amine | CHEMBL566900
TypeSmall organic molecule
Emp. Form.C20H15N3O3
Mol. Mass.345.3514
SMILESC(Nc1ncnc2ccc(cc12)-c1ccc2OCOc2c1)c1ccoc1