Reaction Details
TargetDual specificity protein kinase CLK1
LigandBDBM50342910
Substrate/Competitorn/a
Meas. Tech.ChEMBL_744231 (CHEMBL1772038)
Kd 50±n/a nM
Citation Rosenthal, ASTanega, CShen, MMott, BTBougie, JMNguyen, DTMisteli, TAuld, DSMaloney, DJThomas, CJ Potent and selective small molecule inhibitors of specific isoforms of Cdc2-like kinases (Clk) and dual specificity tyrosine-phosphorylation-regulated kinases (Dyrk). Bioorg Med Chem Lett21:3152-8 (2011) 
 
Dual specificity protein kinase CLK1
Name:Dual specificity protein kinase CLK1
Type:Protein
Mol. Mass.:57322.21
Organism:Homo sapiens (Human)
Description:P49759
Residue:484
BDBM50342910
NameBDBM50342910
Synonyms:6-(benzo[d][1,3]dioxol-5-yl)-N-((2-methylthiazol-4-yl)methyl)quinazolin-4-amine | CHEMBL1435542
TypeSmall organic molecule
Emp. Form.C20H16N4O2S
Mol. Mass.376.432
SMILESCc1nc(CNc2ncnc3ccc(cc23)-c2ccc3OCOc3c2)cs1