Reaction Details
TargetDual specificity protein kinase CLK1
LigandBDBM50342892
Substrate/Competitorn/a
Meas. Tech.ChEMBL_744231 (CHEMBL1772038)
Kd 72±n/a nM
Citation Rosenthal, ASTanega, CShen, MMott, BTBougie, JMNguyen, DTMisteli, TAuld, DSMaloney, DJThomas, CJ Potent and selective small molecule inhibitors of specific isoforms of Cdc2-like kinases (Clk) and dual specificity tyrosine-phosphorylation-regulated kinases (Dyrk). Bioorg Med Chem Lett21:3152-8 (2011) 
 
Dual specificity protein kinase CLK1
Name:Dual specificity protein kinase CLK1
Type:Protein
Mol. Mass.:57322.21
Organism:Homo sapiens (Human)
Description:P49759
Residue:484
BDBM50342892
NameBDBM50342892
Synonyms:6-(benzo[d][1,3]dioxol-5-yl)-N-((tetrahydrofuran-3-yl)methyl)quinazolin-4-amine | CHEMBL1436585
TypeSmall organic molecule
Emp. Form.C20H19N3O3
Mol. Mass.349.3832
SMILESC(Nc1ncnc2ccc(cc12)-c1ccc2OCOc2c1)C1CCOC1