Reaction Details
TargetMatrix metalloproteinase-9
LigandBDBM50343085
Substrate/Competitorn/a
Meas. Tech.ChEMBL_744954 (CHEMBL1771913)
Ki 370±n/a nM
Citation Barta, TEBecker, DPBedell, LJEaston, AMHockerman, SLKiefer, JMunie, GEMathis, KJLi, MHRico, JGVillamil, CIWilliams, JM MMP-13 selectivea-sulfone hydroxamates: a survey of P1' heterocyclic amide isosteres. Bioorg Med Chem Lett21:2820-2 (2011) 
 
Matrix metalloproteinase-9
Name:Matrix metalloproteinase-9
Type:Enzyme
Mol. Mass.:78452.28
Organism:Homo sapiens (Human)
Description:P14780
Residue:707
BDBM50343085
NameBDBM50343085
Synonyms:1-ethyl-N-hydroxy-4-(4-(3-(3-(4-(trifluoromethoxy)phenyl)-1,2,4-oxadiazol-5-yl)propoxy)phenylsulfonyl)piperidine-4-carboxamide | CHEMBL1771220
TypeSmall organic molecule
Emp. Form.C26H29F3N4O7S
Mol. Mass.598.591
SMILESCCN1CCC(CC1)(C(=O)NO)S(=O)(=O)c1ccc(OCCCc2nc(no2)-c2ccc(OC(F)(F)F)cc2)cc1