Reaction Details
TargetInterstitial collagenase
LigandBDBM50343085
Substrate/Competitorn/a
Meas. Tech.ChEMBL_744949 (CHEMBL1771908)
Ki>10000±n/a nM
Citation Barta, TEBecker, DPBedell, LJEaston, AMHockerman, SLKiefer, JMunie, GEMathis, KJLi, MHRico, JGVillamil, CIWilliams, JM MMP-13 selectivea-sulfone hydroxamates: a survey of P1' heterocyclic amide isosteres. Bioorg Med Chem Lett21:2820-2 (2011) 
 
Interstitial collagenase
Name:Interstitial collagenase
Type:Enzyme
Mol. Mass.:54010.26
Organism:Homo sapiens (Human)
Description: P03956
Residue:469
BDBM50343085
NameBDBM50343085
Synonyms:1-ethyl-N-hydroxy-4-(4-(3-(3-(4-(trifluoromethoxy)phenyl)-1,2,4-oxadiazol-5-yl)propoxy)phenylsulfonyl)piperidine-4-carboxamide | CHEMBL1771220
TypeSmall organic molecule
Emp. Form.C26H29F3N4O7S
Mol. Mass.598.591
SMILESCCN1CCC(CC1)(C(=O)NO)S(=O)(=O)c1ccc(OCCCc2nc(no2)-c2ccc(OC(F)(F)F)cc2)cc1