Reaction Details
Target72 kDa type IV collagenase
LigandBDBM50343083
Substrate/Competitorn/a
Meas. Tech.ChEMBL_744950 (CHEMBL1771909)
Ki 400±n/a nM
Citation Barta, TEBecker, DPBedell, LJEaston, AMHockerman, SLKiefer, JMunie, GEMathis, KJLi, MHRico, JGVillamil, CIWilliams, JM MMP-13 selectivea-sulfone hydroxamates: a survey of P1' heterocyclic amide isosteres. Bioorg Med Chem Lett21:2820-2 (2011) 
 
72 kDa type IV collagenase
Name:72 kDa type IV collagenase
Type:Enzyme
Mol. Mass.:73870.36
Organism:Homo sapiens (Human)
Description: P08253
Residue:660
BDBM50343083
NameBDBM50343083
Synonyms:CHEMBL1771218 | N-hydroxy-4-(4-(3-(5-(5-methylpyridin-2-yl)-1H-tetrazol-1-yl)propoxy)phenylsulfonyl)tetrahydro-2H-pyran-4-carboxamide
TypeSmall organic molecule
Emp. Form.C22H26N6O6S
Mol. Mass.502.543
SMILESCc1ccc(nc1)-c1nnnn1CCCOc1ccc(cc1)S(=O)(=O)C1(CCOCC1)C(=O)NO