Reaction Details
TargetStromelysin-1
LigandBDBM50343084
Substrate/Competitorn/a
Meas. Tech.ChEMBL_744951 (CHEMBL1771910)
Ki 31±n/a nM
Citation Barta, TEBecker, DPBedell, LJEaston, AMHockerman, SLKiefer, JMunie, GEMathis, KJLi, MHRico, JGVillamil, CIWilliams, JM MMP-13 selectivea-sulfone hydroxamates: a survey of P1' heterocyclic amide isosteres. Bioorg Med Chem Lett21:2820-2 (2011) 
 
Stromelysin-1
Name:Stromelysin-1
Type:Enzyme
Mol. Mass.:53973.13
Organism:Homo sapiens (Human)
Description: P08254
Residue:477
BDBM50343084
NameBDBM50343084
Synonyms:CHEMBL1771219 | N-hydroxy-4-(4-(3-(3-(4-(trifluoromethoxy)phenyl)-1,2,4-oxadiazol-5-yl)propoxy)phenylsulfonyl)tetrahydro-2H-pyran-4-carboxamide
TypeSmall organic molecule
Emp. Form.C24H24F3N3O8S
Mol. Mass.571.523
SMILESONC(=O)C1(CCOCC1)S(=O)(=O)c1ccc(OCCCc2nc(no2)-c2ccc(OC(F)(F)F)cc2)cc1