Reaction Details
TargetNeutrophil collagenase
LigandBDBM50343087
Substrate/Competitorn/a
Meas. Tech.ChEMBL_744953 (CHEMBL1771912)
Ki 140±n/a nM
Citation Barta, TEBecker, DPBedell, LJEaston, AMHockerman, SLKiefer, JMunie, GEMathis, KJLi, MHRico, JGVillamil, CIWilliams, JM MMP-13 selectivea-sulfone hydroxamates: a survey of P1' heterocyclic amide isosteres. Bioorg Med Chem Lett21:2820-2 (2011) 
 
Neutrophil collagenase
Name:Neutrophil collagenase
Type:Enzyme
Mol. Mass.:53413.48
Organism:Homo sapiens (Human)
Description:P22894
Residue:467
BDBM50343087
NameBDBM50343087
Synonyms:CHEMBL1771222 | N-hydroxy-4-(4-(3-(5-(4-(trifluoromethoxy)phenyl)-1H-imidazol-1-yl)propoxy)phenylsulfonyl)tetrahydro-2H-pyran-4-carboxamide
TypeSmall organic molecule
Emp. Form.C25H26F3N3O7S
Mol. Mass.569.55
SMILESONC(=O)C1(CCOCC1)S(=O)(=O)c1ccc(OCCCn2cncc2-c2ccc(OC(F)(F)F)cc2)cc1