Reaction Details
TargetAdenosine receptor A3
LigandBDBM50082425
Substrate/Competitorn/a
Meas. Tech.ChEMBL_744131 (CHEMBL1771830)
Ki 1.6±n/a nM
Citation Cheong, SLFederico, SVenkatesan, GPaira, PShao, YMSpalluto, GYap, CWPastorin, G Pharmacophore elucidation for a new series of 2-aryl-pyrazolo-triazolo-pyrimidines as potent human A3 adenosine receptor antagonists. Bioorg Med Chem Lett21:2898-905 (2011) 
 
Adenosine receptor A3
Name:Adenosine receptor A3
Type:G Protein-Coupled Receptor (GPCR)
Mol. Mass.:36197.32
Organism:Homo sapiens (Human)
Description:P0DMS8
Residue:318
BDBM50082425
NameBDBM50082425
Synonyms:1-(3-Chloro-phenyl)-3-(8-ethyl-2-furan-2-yl-8H-pyrazolo[4,3-e][1,2,4]triazolo[1,5-c]pyrimidin-5-yl)-urea CHEMBL141154
TypeSmall organic molecule
Emp. Form.C19H15ClN8O2
Mol. Mass.422.828
SMILESCCn1cc2c(n1)nc(NC(=O)Nc1cccc(Cl)c1)n1nc(nc21)-c1ccco1