Reaction Details
TargetAdenosine receptor A3
LigandBDBM50109465
Substrate/Competitorn/a
Meas. Tech.ChEMBL_744131 (CHEMBL1771830)
Ki 3.7±n/a nM
Citation Cheong, SLFederico, SVenkatesan, GPaira, PShao, YMSpalluto, GYap, CWPastorin, G Pharmacophore elucidation for a new series of 2-aryl-pyrazolo-triazolo-pyrimidines as potent human A3 adenosine receptor antagonists. Bioorg Med Chem Lett21:2898-905 (2011) 
 
Adenosine receptor A3
Name:Adenosine receptor A3
Type:G Protein-Coupled Receptor (GPCR)
Mol. Mass.:36197.32
Organism:Homo sapiens (Human)
Description:P0DMS8
Residue:318
BDBM50109465
NameBDBM50109465
Synonyms:1-(8-Butyl-2-furan-2-yl-8H-pyrazolo[4,3-e][1,2,4]triazolo[1,5-c]pyrimidin-5-yl)-3-(3,4-dichloro-phenyl)-urea CHEMBL352707
TypeSmall organic molecule
Emp. Form.C21H18Cl2N8O2
Mol. Mass.485.326
SMILESCCCCn1cc2c(n1)nc(NC(=O)Nc1ccc(Cl)c(Cl)c1)n1nc(nc21)-c1ccco1