Reaction Details
TargetAdenosine receptor A3
LigandBDBM50158776
Substrate/Competitorn/a
Meas. Tech.ChEMBL_744131 (CHEMBL1771830)
Ki 9±n/a nM
Citation Cheong, SLFederico, SVenkatesan, GPaira, PShao, YMSpalluto, GYap, CWPastorin, G Pharmacophore elucidation for a new series of 2-aryl-pyrazolo-triazolo-pyrimidines as potent human A3 adenosine receptor antagonists. Bioorg Med Chem Lett21:2898-905 (2011) 
 
Adenosine receptor A3
Name:Adenosine receptor A3
Type:G Protein-Coupled Receptor (GPCR)
Mol. Mass.:36197.32
Organism:Homo sapiens (Human)
Description:P0DMS8
Residue:318
BDBM50158776
NameBDBM50158776
Synonyms:1-(2-Furan-2-yl-8-phenethyl-8H-pyrazolo[4,3-e][1,2,4]triazolo[1,5-c]pyrimidin-5-yl)-3-isopropyl-urea | CHEMBL361412
TypeSmall organic molecule
Emp. Form.C22H22N8O2
Mol. Mass.430.4625
SMILESCC(C)NC(=O)Nc1nc2nn(CCc3ccccc3)cc2c2nc(nn12)-c1ccco1