Reaction Details
TargetAdenosine receptor A3
LigandBDBM50224356
Substrate/Competitorn/a
Meas. Tech.ChEMBL_744131 (CHEMBL1771830)
Ki 33.2±n/a nM
Citation Cheong, SLFederico, SVenkatesan, GPaira, PShao, YMSpalluto, GYap, CWPastorin, G Pharmacophore elucidation for a new series of 2-aryl-pyrazolo-triazolo-pyrimidines as potent human A3 adenosine receptor antagonists. Bioorg Med Chem Lett21:2898-905 (2011) 
 
Adenosine receptor A3
Name:Adenosine receptor A3
Type:G Protein-Coupled Receptor (GPCR)
Mol. Mass.:36197.32
Organism:Homo sapiens (Human)
Description:P0DMS8
Residue:318
BDBM50224356
NameBDBM50224356
Synonyms:4-amino-2-(4-chloro-phenyl)-3,3a,5,9b-tetraaza-cyclopenta[a]naphthalen-1-one | CHEMBL397821
TypeSmall organic molecule
Emp. Form.C15H10ClN5O
Mol. Mass.311.726
SMILESNc1nc2ccccc2n2n1nc(-c1ccc(Cl)cc1)c2=O