Reaction Details
TargetRAC-alpha serine/threonine-protein kinase
LigandBDBM50343192
Substrate/Competitorn/a
Meas. Tech.ChEMBL_745561 (CHEMBL1775878)
IC50>5000±n/a nM
Citation D'Angelo, NDKim, TSAndrews, KBooker, SKCaenepeel, SChen, KD'Amico, DFreeman, DJiang, JLiu, LMcCarter, JDSan Miguel, TMullady, ELSchrag, MSubramanian, RTang, JWahl, RCWang, LWhittington, DAWu, TXi, NXu, YYakowec, PYang, KZalameda, LPZhang, NHughes, PNorman, MH Discovery and optimization of a series of benzothiazole phosphoinositide 3-kinase (PI3K)/mammalian target of rapamycin (mTOR) dual inhibitors. J Med Chem54:1789-811 (2011) 
 
RAC-alpha serine/threonine-protein kinase
Name:RAC-alpha serine/threonine-protein kinase
Type:Enzyme
Mol. Mass.:55681.25
Organism:Homo sapiens (Human)
Description:P31749
Residue:480
BDBM50343192
NameBDBM50343192
Synonyms:CHEMBL1773579 | N-(6-(2-(3-Fluorophenylsulfonamido)pyrimidin-4-yl)benzo-[d]thiazol-2-yl)acetamide
TypeSmall organic molecule
Emp. Form.C19H14FN5O3S2
Mol. Mass.443.475
SMILESCC(=O)Nc1nc2ccc(cc2s1)-c1ccnc(NS(=O)(=O)c2cccc(F)c2)n1