Reaction Details
TargetRAC-alpha serine/threonine-protein kinase
LigandBDBM50343196
Substrate/Competitorn/a
Meas. Tech.ChEMBL_745561 (CHEMBL1775878)
IC50 33±n/a nM
Citation D'Angelo, NDKim, TSAndrews, KBooker, SKCaenepeel, SChen, KD'Amico, DFreeman, DJiang, JLiu, LMcCarter, JDSan Miguel, TMullady, ELSchrag, MSubramanian, RTang, JWahl, RCWang, LWhittington, DAWu, TXi, NXu, YYakowec, PYang, KZalameda, LPZhang, NHughes, PNorman, MH Discovery and optimization of a series of benzothiazole phosphoinositide 3-kinase (PI3K)/mammalian target of rapamycin (mTOR) dual inhibitors. J Med Chem54:1789-811 (2011) 
 
RAC-alpha serine/threonine-protein kinase
Name:RAC-alpha serine/threonine-protein kinase
Type:Enzyme
Mol. Mass.:55681.25
Organism:Homo sapiens (Human)
Description:P31749
Residue:480
BDBM50343196
NameBDBM50343196
Synonyms:CHEMBL1773558 | N-(6-(2-(4-Methoxyphenylsulfonamido)pyridin-4-yl)benzo-[d]thiazol-2-yl)acetamide
TypeSmall organic molecule
Emp. Form.C21H18N4O4S2
Mol. Mass.454.522
SMILESCOc1ccc(cc1)S(=O)(=O)Nc1cc(ccn1)-c1ccc2nc(NC(C)=O)sc2c1