Reaction Details
TargetSerine/threonine-protein kinase mTOR
LigandBDBM50343200
Substrate/Competitorn/a
Meas. Tech.ChEMBL_745549 (CHEMBL1775866)
IC50 2±n/a nM
Citation D'Angelo, NDKim, TSAndrews, KBooker, SKCaenepeel, SChen, KD'Amico, DFreeman, DJiang, JLiu, LMcCarter, JDSan Miguel, TMullady, ELSchrag, MSubramanian, RTang, JWahl, RCWang, LWhittington, DAWu, TXi, NXu, YYakowec, PYang, KZalameda, LPZhang, NHughes, PNorman, MH Discovery and optimization of a series of benzothiazole phosphoinositide 3-kinase (PI3K)/mammalian target of rapamycin (mTOR) dual inhibitors. J Med Chem54:1789-811 (2011) 
 
Serine/threonine-protein kinase mTOR
Name:Serine/threonine-protein kinase mTOR
Type:Rapamycin target protein
Mol. Mass.:288917.12
Organism:Homo sapiens (Human)
Description:P42345
Residue:2549
BDBM50343200
NameBDBM50343200
Synonyms:CHEMBL1615189 N-[6-(6-chloro-5-{[(4-fluorophenyl)sulfonyl]amino}pyridin-3-yl)-1,3-benzothiazol-2-yl]acetamide
TypeSmall organic molecule
Emp. Form.C20H14ClFN4O3S2
Mol. Mass.476.932
SMILESCC(=O)Nc1nc2ccc(cc2s1)-c1cnc(Cl)c(NS(=O)(=O)c2ccc(F)cc2)c1