Reaction Details
TargetBaculoviral IAP repeat-containing protein 2
LigandBDBM50343510
Substrate/Competitorn/a
Meas. Tech.ChEMBL_746786 (CHEMBL1777016)
Ki 2±n/a nM
Citation Sun, HLiu, LLu, JBai, LLi, XNikolovska-Coleska, ZMcEachern, DYang, CYQiu, SYi, HSun, DWang, S Potent bivalent Smac mimetics: effect of the linker on binding to inhibitor of apoptosis proteins (IAPs) and anticancer activity. J Med Chem54:3306-18 (2011) 
 
Baculoviral IAP repeat-containing protein 2
Name:Baculoviral IAP repeat-containing protein 2
Type:Protein
Mol. Mass.:69900.47
Organism:Homo sapiens (Human)
Description:Q13490
Residue:618
BDBM50343510
NameBDBM50343510
Synonyms:(S,3S,3'S,6S,6'S,1'aS,1'a'S)-N,N'-((1S,1'S)-(1,1'-(1,4-Phenylenebis-(methylene))bis(1H-1,2,3-triazole-4,1-diyl))bis(phenylmethylene))bis-(6-((S)-2-(methylamino)propanamido)-5-oxodecahydropyrrolo[1,2-a]azocine-3-carboxamide) | CHEMBL1773083
TypeSmall organic molecule
Emp. Form.C56H72N14O6
Mol. Mass.1037.2611
SMILESCN[C@@H](C)C(=O)N[C@H]1CCCC[C@H]2CC[C@H](N2C1=O)C(=O)N[C@H](c1cn(Cc2ccc(Cn3cc(nn3)[C@@H](NC(=O)[C@@H]3CC[C@@H]4CCCC[C@H](NC(=O)[C@H](C)NC)C(=O)N34)c3ccccc3)cc2)nn1)c1ccccc1