Reaction Details
TargetE3 ubiquitin-protein ligase XIAP
LigandBDBM50343511
Substrate/Competitorn/a
Meas. Tech.ChEMBL_746784 (CHEMBL1776953)
Ki 4±n/a nM
Citation Sun, HLiu, LLu, JBai, LLi, XNikolovska-Coleska, ZMcEachern, DYang, CYQiu, SYi, HSun, DWang, S Potent bivalent Smac mimetics: effect of the linker on binding to inhibitor of apoptosis proteins (IAPs) and anticancer activity. J Med Chem54:3306-18 (2011) 
 
E3 ubiquitin-protein ligase XIAP
Name:E3 ubiquitin-protein ligase XIAP
Type:Protein
Mol. Mass.:56685.27
Organism:Homo sapiens (Human)
Description:P98170
Residue:497
BDBM50343511
NameBDBM50343511
Synonyms:(3S,6S,1'aS)-6-((S)-2-(Methylamino)propanamido)-N-((1-(2-(2-(2-(2-(4-((S)-((3S,6S,1'aS)-6-((S)-2-(methylamino)propanamido)-5-oxodecahydropyrrolo[1,2-a]azocine-3-carboxamido)(phenyl)methyl)-1H-1,2,3-triazol-1-yl)ethoxy)ethoxy)ethoxy)ethyl)-1H-1,2,3-triazol-4-yl)(phenyl)methyl)-5-oxodecahydropyrrolo[1,2-a]azocine-3-carboxamide | CHEMBL1774165
TypeSmall organic molecule
Emp. Form.C56H80N14O9
Mol. Mass.1093.3228
SMILESCN[C@@H](C)C(=O)N[C@H]1CCCC[C@H]2CC[C@H](N2C1=O)C(=O)N[C@H](c1cn(CCOCCOCCOCCn2cc(nn2)[C@@H](NC(=O)[C@@H]2CC[C@@H]3CCCC[C@H](NC(=O)[C@H](C)NC)C(=O)N23)c2ccccc2)nn1)c1ccccc1