Reaction Details
TargetBaculoviral IAP repeat-containing protein 2
LigandBDBM50343517
Substrate/Competitorn/a
Meas. Tech.ChEMBL_746787 (CHEMBL1777017)
IC50 7.4±n/a nM
Citation Sun, HLiu, LLu, JBai, LLi, XNikolovska-Coleska, ZMcEachern, DYang, CYQiu, SYi, HSun, DWang, S Potent bivalent Smac mimetics: effect of the linker on binding to inhibitor of apoptosis proteins (IAPs) and anticancer activity. J Med Chem54:3306-18 (2011) 
 
Baculoviral IAP repeat-containing protein 2
Name:Baculoviral IAP repeat-containing protein 2
Type:Protein
Mol. Mass.:69900.47
Organism:Homo sapiens (Human)
Description:Q13490
Residue:618
BDBM50343517
NameBDBM50343517
Synonyms:(S,3S,3'S,6S,6'S,1'aS,1'a'S)-N,N'-((1S,1'S)-(1,1'-(Oxybis(pentane-5,1-diyl))bis(1H-1,2,3-triazole-4,1-diyl))bis(phenylmethylene))bis(6-((S)-2-(methylamino)propanamido)-5-oxodecahydropyrrolo[1,2-a]azocine-3-carboxamide) | CHEMBL1774163
TypeSmall organic molecule
Emp. Form.C58H84N14O7
Mol. Mass.1089.3772
SMILESCN[C@@H](C)C(=O)N[C@H]1CCCC[C@H]2CC[C@H](N2C1=O)C(=O)N[C@H](c1cn(CCCCCOCCCCCn2cc(nn2)[C@@H](NC(=O)[C@@H]2CC[C@@H]3CCCC[C@H](NC(=O)[C@H](C)NC)C(=O)N23)c2ccccc2)nn1)c1ccccc1