Reaction Details
TargetProstaglandin E synthase
LigandBDBM50168761
Substrate/Competitorn/a
Meas. Tech.ChEMBL_746975 (CHEMBL1777341)
IC50 7±n/a nM
Citation Waltenberger, BWiechmann, KBauer, JMarkt, PNoha, SMWolber, GRollinger, JMWerz, OSchuster, DStuppner, H Pharmacophore modeling and virtual screening for novel acidic inhibitors of microsomal prostaglandin E2 synthase-1 (mPGES-1). J Med Chem54:3163-74 (2011) 
 
Prostaglandin E synthase
Name:Prostaglandin E synthase
Type:Protein
Mol. Mass.:17112.22
Organism:Homo sapiens (Human)
Description:n/a
Residue:152
BDBM50168761
NameBDBM50168761
Synonyms:3-(1-(4-chlorobenzyl)-5-(2-fluorobiphenyl-4-yl)-3-methyl-1H-indol-2-yl)-2,2-dimethylpropanoic acid CHEMBL182032
TypeSmall organic molecule
Emp. Form.C33H29ClFNO2
Mol. Mass.526.04
SMILESCc1c(CC(C)(C)C(O)=O)n(Cc2ccc(Cl)cc2)c2ccc(cc12)-c1ccc(c(F)c1)-c1ccccc1