Reaction Details
TargetProstaglandin E synthase
LigandBDBM50343539
Substrate/Competitorn/a
Meas. Tech.ChEMBL_746975 (CHEMBL1777341)
IC50 70±n/a nM
Citation Waltenberger, BWiechmann, KBauer, JMarkt, PNoha, SMWolber, GRollinger, JMWerz, OSchuster, DStuppner, H Pharmacophore modeling and virtual screening for novel acidic inhibitors of microsomal prostaglandin E2 synthase-1 (mPGES-1). J Med Chem54:3163-74 (2011) 
 
Prostaglandin E synthase
Name:Prostaglandin E synthase
Type:Protein
Mol. Mass.:17112.22
Organism:Homo sapiens (Human)
Description:n/a
Residue:152
BDBM50343539
NameBDBM50343539
Synonyms:5-(4-tert-butylbenzyl)-3-(4-isopropoxyphenyl)-1-(4-(isopropylamino)phenyl)-1H-indole-2-carboxylic acid | CHEMBL453202
TypeSmall organic molecule
Emp. Form.C38H42N2O3
Mol. Mass.574.7517
SMILESCC(C)Nc1ccc(cc1)-n1c(C(O)=O)c(-c2ccc(OC(C)C)cc2)c2cc(Cc3ccc(cc3)C(C)(C)C)ccc12