Reaction Details
TargetMelatonin receptor type 1A
LigandBDBM50343597
Substrate/Competitorn/a
Meas. Tech.ChEMBL_746047 (CHEMBL1775434)
Ki 0.069±n/a nM
Citation Koike, THoashi, YTakai, TNakayama, MYukuhiro, NIshikawa, THirai, KUchikawa, O 1,6-Dihydro-2H-indeno[5,4-b]furan derivatives: design, synthesis, and pharmacological characterization of a novel class of highly potent MT2-selective agonists. J Med Chem54:3436-44 (2011) 
 
Melatonin receptor type 1A
Name:Melatonin receptor type 1A
Type:Enzyme
Mol. Mass.:39392.94
Organism:Homo sapiens (Human)
Description:P48039
Residue:350
BDBM50343597
NameBDBM50343597
Synonyms:CHEMBL1774524 | N-[2-(7-Pyridin-3-yl-1,6-dihydro-2H-indeno[5,4-b]furan-8-yl)-ethyl]acetamide
TypeSmall organic molecule
Emp. Form.C20H20N2O2
Mol. Mass.320.385
SMILESCC(=O)NCCC1=C(Cc2ccc3OCCc3c12)c1cccnc1