Reaction Details
TargetMelatonin receptor type 1A
LigandBDBM50343609
Substrate/Competitorn/a
Meas. Tech.ChEMBL_746047 (CHEMBL1775434)
Ki 0.045±n/a nM
Citation Koike, THoashi, YTakai, TNakayama, MYukuhiro, NIshikawa, THirai, KUchikawa, O 1,6-Dihydro-2H-indeno[5,4-b]furan derivatives: design, synthesis, and pharmacological characterization of a novel class of highly potent MT2-selective agonists. J Med Chem54:3436-44 (2011) 
 
Melatonin receptor type 1A
Name:Melatonin receptor type 1A
Type:Enzyme
Mol. Mass.:39392.94
Organism:Homo sapiens (Human)
Description:P48039
Residue:350
BDBM50343609
NameBDBM50343609
Synonyms:CHEMBL1774512 | N-[2-(1,6-Dihydro-2H-indeno[5,4-b]furan-8-yl)ethyl]acetamide
TypeSmall organic molecule
Emp. Form.C15H17NO2
Mol. Mass.243.301
SMILESCC(=O)NCCC1=CCc2ccc3OCCc3c12