Reaction Details
TargetDelta-type opioid receptor
LigandBDBM50343623
Substrate/Competitorn/a
Meas. Tech.ChEMBL_746789 (CHEMBL1777019)
Ki 39±n/a nM
Citation Zhang, BZhang, TSromek, AWScrimale, TBidlack, JMNeumeyer, JL Synthesis and binding affinity of novel mono- and bivalent morphinan ligands for κ, μ, and δ opioid receptors. Bioorg Med Chem19:2808-16 (2011) 
 
Delta-type opioid receptor
Name:Delta-type opioid receptor
Type:G Protein-Coupled Receptor (GPCR)
Mol. Mass.:40382.98
Organism:Homo sapiens (Human)
Description:Competition binding assays were carried out using membrane preparations from transfected HN9.10 cells that constitutively expressed the delta opioid receptor.
Residue:372
BDBM50343623
NameBDBM50343623
Synonyms:(-)-3,30-(Decane-1,10-diaminothiazolo)bis(cyclopropylmethyl)morphinan | CHEMBL1774952
TypeSmall organic molecule
Emp. Form.C52H72N6S2
Mol. Mass.845.298
SMILESC(CCCCCNc1nc2cc3c(C[C@@H]4[C@@H]5CCCC[C@]35CCN4CC3CC3)cc2s1)CCCCNc1nc2cc3c(C[C@@H]4[C@@H]5CCCC[C@]35CCN4CC3CC3)cc2s1