Reaction Details
TargetDelta-type opioid receptor
LigandBDBM50343627
Substrate/Competitorn/a
Meas. Tech.ChEMBL_746789 (CHEMBL1777019)
Ki 14±n/a nM
Citation Zhang, BZhang, TSromek, AWScrimale, TBidlack, JMNeumeyer, JL Synthesis and binding affinity of novel mono- and bivalent morphinan ligands for κ, μ, and δ opioid receptors. Bioorg Med Chem19:2808-16 (2011) 
 
Delta-type opioid receptor
Name:Delta-type opioid receptor
Type:G Protein-Coupled Receptor (GPCR)
Mol. Mass.:40382.98
Organism:Homo sapiens (Human)
Description:Competition binding assays were carried out using membrane preparations from transfected HN9.10 cells that constitutively expressed the delta opioid receptor.
Residue:372
BDBM50343627
NameBDBM50343627
Synonyms:Benzyl-(-)-14-methoxy-butorphanol-3-yl-decanedioate | CHEMBL1773091
TypeSmall organic molecule
Emp. Form.C39H53NO5
Mol. Mass.615.8418
SMILESCO[C@@]12CCCC[C@@]11CCN(CC3CCC3)[C@@H]2Cc2ccc(OC(=O)CCCCCCCCC(=O)OCc3ccccc3)cc12