Reaction Details
TargetMu-type opioid receptor
LigandBDBM50343625
Substrate/Competitorn/a
Meas. Tech.ChEMBL_746792 (CHEMBL1777022)
EC50 1.2±n/a nM
Citation Zhang, BZhang, TSromek, AWScrimale, TBidlack, JMNeumeyer, JL Synthesis and binding affinity of novel mono- and bivalent morphinan ligands for κ, μ, and δ opioid receptors. Bioorg Med Chem19:2808-16 (2011) 
 
Mu-type opioid receptor
Name:Mu-type opioid receptor
Type:G Protein-Coupled Receptor (GPCR)
Mol. Mass.:44789.51
Organism:Homo sapiens (Human)
Description:P35372
Residue:400
BDBM50343625
NameBDBM50343625
Synonyms:(-)-17-N-Cyclobutylmethyl)morphinan-3-yl-(-)-14-hydroxyl-17-N-cyclobutylmethyl-morphinan-3-yl-decanedioate | CHEMBL1774949
TypeSmall organic molecule
Emp. Form.C52H72N2O5
Mol. Mass.805.1385
SMILESO[C@@]12CCCC[C@@]11CCN(CC3CCC3)[C@@H]2Cc2ccc(OC(=O)CCCCCCCCC(=O)Oc3ccc4C[C@@H]5[C@@H]6CCCC[C@]6(CCN5CC5CCC5)c4c3)cc12