Reaction Details
TargetMu-type opioid receptor
LigandBDBM50343629
Substrate/Competitorn/a
Meas. Tech.ChEMBL_746793 (CHEMBL1777023)
Ki 0.140000±n/a nM
Citation Zhang, BZhang, TSromek, AWScrimale, TBidlack, JMNeumeyer, JL Synthesis and binding affinity of novel mono- and bivalent morphinan ligands for κ, μ, and δ opioid receptors. Bioorg Med Chem19:2808-16 (2011) 
 
Mu-type opioid receptor
Name:Mu-type opioid receptor
Type:G Protein-Coupled Receptor (GPCR)
Mol. Mass.:44789.51
Organism:Homo sapiens (Human)
Description:P35372
Residue:400
BDBM50343629
NameBDBM50343629
Synonyms:(-)-14-Methoxybutorphanol | CHEMBL1774946
TypeSmall organic molecule
Emp. Form.C22H31NO2
Mol. Mass.341.487
SMILESCO[C@@]12CCCC[C@@]11CCN(CC3CCC3)[C@@H]2Cc2ccc(O)cc12