Reaction Details
TargetTyrosine-protein kinase JAK3
LigandBDBM50343723
Substrate/Competitorn/a
Meas. Tech.ChEMBL_746714 (CHEMBL1776839)
IC50 183±n/a nM
Citation Wang, TIoannidis, SAlmeida, LBlock, MHDavies, AMLamb, MLScott, DASu, MZhang, HJAlimzhanov, MBebernitz, GBell, KZinda, M In vitro and in vivo evaluation of 6-aminopyrazolyl-pyridine-3-carbonitriles as JAK2 kinase inhibitors. Bioorg Med Chem Lett21:2958-61 (2011) 
 
Tyrosine-protein kinase JAK3
Name:Tyrosine-protein kinase JAK3
Type:Protein
Mol. Mass.:125111.08
Organism:Homo sapiens (Human)
Description:P52333
Residue:1124
BDBM50343723
NameBDBM50343723
Synonyms:(S)-6-(5-cyclopropyl-1H-pyrazol-3-ylamino)-5-fluoro-2-(1-(4-fluorophenyl)ethylamino)nicotinonitrile | CHEMBL1774053
TypeSmall organic molecule
Emp. Form.C20H18F2N6
Mol. Mass.380.3939
SMILESC[C@H](Nc1nc(Nc2cc(n[nH]2)C2CC2)c(F)cc1C#N)c1ccc(F)cc1