Reaction Details
TargetTyrosine-protein kinase JAK3
LigandBDBM50343726
Substrate/Competitorn/a
Meas. Tech.ChEMBL_746719 (CHEMBL1776844)
IC50 15±n/a nM
Citation Wang, TIoannidis, SAlmeida, LBlock, MHDavies, AMLamb, MLScott, DASu, MZhang, HJAlimzhanov, MBebernitz, GBell, KZinda, M In vitro and in vivo evaluation of 6-aminopyrazolyl-pyridine-3-carbonitriles as JAK2 kinase inhibitors. Bioorg Med Chem Lett21:2958-61 (2011) 
 
Tyrosine-protein kinase JAK3
Name:Tyrosine-protein kinase JAK3
Type:Protein
Mol. Mass.:125111.08
Organism:Homo sapiens (Human)
Description:P52333
Residue:1124
BDBM50343726
NameBDBM50343726
Synonyms:(S)-5-fluoro-2-(1-(5-fluoropyridin-2-yl)ethylamino)-6-(5-methyl-1H-pyrazol-3-ylamino)nicotinonitrile | CHEMBL1774056
TypeSmall organic molecule
Emp. Form.C17H15F2N7
Mol. Mass.355.3447
SMILESC[C@H](Nc1nc(Nc2cc(C)n[nH]2)c(F)cc1C#N)c1ccc(F)cn1